Crisis in the Classroom
type: Concept
definition: Written for both the professional educator and the layperson, Crisis in the Classroom: The Remaking of American Education, published in 1970, brought national attention to the problems of schooling and introduced the term mindlessness that quickly became a common criticism of educational programming. Charles Silberman's critique of the (repressive) elementary school curriculum was surpassed by his assessment of the secondary school program—a curriculum that instilled passivity and conformity—and that of the middle school or junior high, which he described as a wasteland of U.S. education. [Source: Encyclopedia of Curriculum Studies; Crisis in the Classroom]
broader: publications

publications
type: Concept
narrower: Crisis in the Classroom

concepts
type: Collection
type: ConceptGroup
member: Crisis in the Classroom