West Indies
type: Concept
narrower: Cuba

Cuba
type: Concept
definition: Cuba is a Caribbean island between the Caribbean Sea and the North Atlantic Ocean. It is approximately 90 miles off the U.S. coast of Florida. [Source: Encyclopedia of Drug Policy; Cuba]
broader: West Indies

concepts
type: Collection
type: ConceptGroup
member: Cuba