Dalkon Shield
type: Concept
definition: an intrauterine device (IUD) that was widely distributed and marketed by the A. H. [Source: The Concise Dictionary of Crime and Justice; Dalkon Shield]
broader: cases in business ethics

cases in business ethics
type: Concept
narrower: Dalkon Shield

organizations
type: Collection
type: ConceptGroup
member: Dalkon Shield