theories, models, and philosophical perspectives
type: Concept
narrower: Dalton Plan

Dalton Plan
type: Concept
definition: The Dalton Plan was the progressive pedagogical model used by Helen Parkhurst, who founded the Dalton School in New York City in 1919. Her book, Education on the Dalton Plan, was published in 1922, and within six months of publication it was translated into fourteen languages. [Source: Encyclopedia of the Social and Cultural Foundations of Education; Dalton Plan]
broader: theories, models, and philosophical perspectives

concepts
type: Collection
type: ConceptGroup
member: Dalton Plan