Dan Nimmo
type: Concept
definition: Dan Nimmo was one of the most productive and influential scholars to write and teach about political communication. To his work, he brought a broadly educated mind, a profound knowledge of political science, and a great respect for the role that communication plays in politics. [Source: Encyclopedia of Political Communication; Nimmo, Dan (1933–2004)]
broader: key people in political communication

key people in political communication
type: Concept
narrower: Dan Nimmo

people
type: Collection
type: ConceptGroup
member: Dan Nimmo