key people in political communication
type: Concept
narrower: Dan Quayle

Dan Quayle
type: Concept
definition: James Danforth Quayle, born to James and Corrine Quayle in Indianapolis, Indiana, served as vice president of the United States under President George H. W. Bush from 1989 to 1993. At the time of his birth, his father, Jim Quayle, a far-right conservative and member of the John Birch Society, was a middle manager with the Huntington Herald-Press newspaper, owned by his fatherin-law, Eugene Pullman, in the small town of Huntington, Indiana. [Source: Encyclopedia of Political Communication; Quayle, Dan (1947–)]
broader: key people in political communication

people
type: Collection
type: ConceptGroup
member: Dan Quayle