key people in political communication
type: Concept
narrower: Dan Rather

people
type: Collection
type: ConceptGroup
member: Dan Rather

Dan Rather
type: Concept
definition: Dan Rather spent 24 years as anchor of CBS Evening News and was called “the hardest working man in broadcast journalism,” receiving nearly every major broadcast journalism award. Born in Wharton, Texas, Rather graduated in 1953 from Sam Houston State Teachers College with a journalism degree. [Source: Encyclopedia of Political Communication; Rather, Dan (1931–)]
broader: key people in political communication