people associated with terrorism
type: Concept
narrower: Daniel Pearl

Daniel Pearl
type: Concept
definition: Daniel Pearl, a reporter for The Wall Street Journal, was investigating terrorist groups in Pakistan when he was kidnapped and later murdered by Islamic extremists. Pearl was born in Princeton, New Jersey, in 1963. [Source: The SAGE Encyclopedia of Terrorism; Pearl, Daniel (1963–2002)]
broader: people associated with terrorism

people
type: Collection
type: ConceptGroup
member: Daniel Pearl