evolution
type: Concept
narrower: Darwin and Germany

concepts
type: Collection
type: ConceptGroup
member: Darwin and Germany

Darwin and Germany
type: Concept
definition: We can analyze Charles Darwin's influence in Germany by examining four connections. These include, first, Darwin's relationship to social Darwinism and, in particular, to Hitler and the Third Reich, as many people still tend to see a strong link between these two movements. [Source: Encyclopedia of Anthropology; Darwin and Germany]
broader: evolution