David Broder
type: Concept
definition: David Salzer Broder is a well-known journalist for The Washington Post, a news organization he joined in 1966. He was born and raised in Chicago Heights, Illinois, and attended the University of Chicago, where he received both a bachelor's degree and a master's degree in political science. [Source: Encyclopedia of Political Communication; Broder, David (1929–)]
broader: key people in political communication

key people in political communication
type: Concept
narrower: David Broder

people
type: Collection
type: ConceptGroup
member: David Broder