David Friedrichs
type: Concept
definition: David Friedrichs, born in 1944, is a distinguished university fellow and professor of sociology and criminal justice at the University of Scranton, in Pennsylvania. He is a prolific writer on white-collar and corporate crime, including state crime. [Source: Encyclopedia of White-Collar and Corporate Crime; Friedrichs, David]
broader: key people in white-collar and corporate crime

key people in white-collar and corporate crime
type: Concept
narrower: David Friedrichs

people
type: Collection
type: ConceptGroup
member: David Friedrichs