Department of State
type: Concept
definition: Department that advises the president on foreign affairs. The State Department is the senior executive department of the U.S. government. [Source: Student's Guide to the Presidency; Department of State]
broader: executive branch

executive branch
type: Concept
narrower: Department of State

organizations
type: Collection
type: ConceptGroup
member: Department of State