organizations
type: Collection
type: ConceptGroup
member: Easter Seals

religious and secular charities
type: Concept
narrower: Easter Seals

Easter Seals
type: Concept
definition: THE NATIONAL SOCIETY FOR Crippled Children and the International Society for Crippled Children are the precursors to the Easter Seals organization. The impetus behind these was the International Association of Rotary Clubs, later known as Rotary International (RI), a worldwide nonprofit organization of professionals that provides humanitarian services across the globe. [Source: Encyclopedia of World Poverty; Easter Seals]
broader: religious and secular charities