concepts
type: Collection
type: ConceptGroup
member: European curriculum studies

European curriculum studies
type: Concept
definition: Curriculum studies as a field of education may today be found in continental Europe (including the Nordic countries) in most universities, teacher education institutions, and institutions of further training. This tendency represents in certain ways a late 20th-century development. [Source: Encyclopedia of Curriculum Studies; European Curriculum Studies, Continental Overview]
broader: comparative education

comparative education
type: Concept
narrower: European curriculum studies