Experimental Cartography Unit
type: Concept
definition: The Experimental Cartography Unit (ECU) was a research unit of Britain's Natural Environment Research Council (NERC), initially established at the Clarendon Press in Oxford, in 1967, to advance the art, science, technology, and practice of making maps by computers. The ECU was a phenomenon. [Source: Encyclopedia of Geographic Information Science; Experimental Cartography Unit (ECU)]
broader: organizational and institutional aspects

organizational and institutional aspects
type: Concept
narrower: Experimental Cartography Unit

organizations
type: Collection
type: ConceptGroup
member: Experimental Cartography Unit