assessment areas and techniques
type: Concept
narrower: FIRO-B

concepts
type: Collection
type: ConceptGroup
member: FIRO-B

FIRO-B
type: Concept
definition: FIRO-B (rhymes with “Cairo”) is an acronym for Fundamental Interpersonal Relations Orientation-Behavior, a psychological instrument developed by William C. Schutz and fully described in 1958. The FIRO-B was originally developed to support the use of interpersonal compatibility as the basis for work group design in military settings. [Source: Encyclopedia of Career Development; Firo-B]
broader: assessment areas and techniques