Garrett Hardin
type: Concept
definition: Garrett james hardin, born in 1915, was an ecologist from Dallas, Texas. Hardin graduated from the University of Chicago in 1936 with a BSc in Zoology, and in 1941 was awarded a Ph.D. in microbiology from Stanford University. [Source: Encyclopedia of Environment and Society; Hardin, Garrett (1915–2003)]
broader: key people in environment and society

key people in environment and society
type: Concept
narrower: Garrett Hardin

people
type: Collection
type: ConceptGroup
member: Garrett Hardin