serial murder
type: Concept
narrower: Genene Jones

Genene Jones
type: Concept
definition: In 1982, Genene Jones left Bexar County Medical Center Hospital, in Texas, in the wake of investigations into numerous, inexplicable infants' and young children's deaths. She then took a licensed vocational nursing position at Kerr County clinic. [Source: Encyclopedia of Murder and Violent Crime; Genene Jones]
broader: serial murder

people
type: Collection
type: ConceptGroup
member: Genene Jones