concepts
type: Collection
type: ConceptGroup
member: Greece

Greece
type: Concept
definition: GREECE, ONE OF the birthplaces of democracy, is home to powerful leftist political forces that ruled the country almost continuously from 1981 to 2004. Although ousted from government in the March 2004 general elections, the socialist-led Greek left remains a potent source of generous patronage and a controversial symbol of runaway social spending and virulent anti-Americanism. [Source: Encyclopedia of Politics: The Left and the Right: Volume 1: The Left and Volume 2: The Right; Greece]
broader: Europe

Europe
type: Concept
narrower: Greece