Guadeloupe
type: Concept
definition: Predominantly Catholic, the island nation of Guadeloupe in the eastern Caribbean is a former French Antillean colony that has been considered an overseas department (département d'outremer) of France since 1946. The island's residents are French citizens with all the rights, privileges, and responsibilities of French nationals, including military duties. [Source: Encyclopedia of Global Religion; Guadeloupe]
broader: West Indies

West Indies
type: Concept
narrower: Guadeloupe

concepts
type: Collection
type: ConceptGroup
member: Guadeloupe