Guatemala
type: Concept
definition: Guatemala is one of the seven Central American countries with almost half of its ecosystems under some legal status of protection. Its longest border is with Mexico to the north, with Honduras and El Salvador to the south, and the still-disputed Belize to the east. [Source: Encyclopedia of Global Warming & Climate Change; Guatemala]
broader: Central America

Central America
type: Concept
narrower: Guatemala

concepts
type: Collection
type: ConceptGroup
member: Guatemala