industrial/commercial consumption and waste
type: Concept
narrower: Hanford Nuclear Reservation

concepts
type: Collection
type: ConceptGroup
member: Hanford Nuclear Reservation

Hanford Nuclear Reservation
type: Concept
definition: The Hanford Nuclear Reservation (Hanford), the largest nuclear waste site in the Western Hemisphere, is located in the state of Washington. Maintained by the U.S. [Source: Encyclopedia of Consumption and Waste: The Social Science of Garbage; Hanford Nuclear Reservation]
broader: industrial/commercial consumption and waste