Hispanic prisoners
type: Concept
definition: The terms Latino/a and Hispanic typically refer to people of Spanish origin. Latinos and Latinas are the fastest-growing minority group in the United States, growing seven times faster than the general population. [Source: Encyclopedia of Prisons & Correctional Facilities; Hispanic/Latino(A) Prisoners]
broader: prison population

prison population
type: Concept
narrower: Hispanic prisoners

concepts
type: Collection
type: ConceptGroup
member: Hispanic prisoners