Honduras
type: Concept
definition: Honduras is located in the heart of central America, between Nicaragua, El Salvador, and Guatemala. The country won independence from Spain in 1821 and has managed to stay largely clear of the endless civil wars that have plagued its neighbors, but it has never prospered in its relative freedom, and most of its citizens struggle to stay afloat. [Source: Encyclopedia of Global Health; Honduras]
broader: Central America

Central America
type: Concept
narrower: Honduras

concepts
type: Collection
type: ConceptGroup
member: Honduras