concepts
type: Collection
type: ConceptGroup
member: IQ

IQ
type: Concept
definition: IQ stands for intelligence quotient, which is a psychometric test (psychological measurement) for measuring a person's intelligence when compared to other people of the same age. The most popular IQ test was developed by a French psychologist Alfred Binet in early 19th century. [Source: Sociology of Education: An A-to-Z Guide; IQ]
broader: education beyond schools

education beyond schools
type: Concept
narrower: IQ