Middle East
type: Concept
narrower: Iraq

concepts
type: Collection
type: ConceptGroup
member: Iraq

Iraq
type: Concept
definition: Iraq is a Middle Eastern Country with an area of 169,235 square miles (438,317 square kilometers) and a July 2012 population estimated at 31.1 million, with 66 percent of the population living in urban areas. Almost half (46 percent) of the population are under age 18, and 3 percent are over age 60. [Source: Cultural Sociology of Mental Illness: An A-to-Z Guide; Iraq]
broader: Middle East