Islam in prison
type: Concept
definition: The religion of Islam has increased rapidly in the United States and its prisons over the past 40 years. There are currently an estimated 5 to 7 million Muslims in the United States, with the following ethnic distribution: 29% are African American, 29% are South Asian, and 20% are Arab. [Source: Encyclopedia of Prisons & Correctional Facilities; Islam in Prison]
broader: prison life

prison life
type: Concept
narrower: Islam in prison

concepts
type: Collection
type: ConceptGroup
member: Islam in prison