Istanbul terrorist attacks
type: Concept
definition: One of the deadliest terrorist attacks in Europe in recent years, the Istanbul terrorist attacks are characterized by two separate bombings: the first on November 15, 2003, and the second on November 20, leaving 57 people dead and around 700 people wounded. Because the event occurred in Istanbul, the largest cultural and economic city in Turkey, the event was named the Istanbul Terrorist Attacks or the Istanbul Bombings. [Source: Encyclopedia of Disaster Relief; Istanbul Terrorist Attacks (2003)]
end: 2003
start: 2003
date: 2003
broader: terrorist attacks

terrorist attacks
type: Concept
narrower: Istanbul terrorist attacks

events
type: Collection
type: ConceptGroup
member: Istanbul terrorist attacks