Jamaat-e-Islami
type: Concept
definition: The Jamaat-e-Islami (JI; lit. “Islamic congregation” or “Islamic party”) is Pakistan's oldest religio-political party and is also among the most influential Islamic revivalist movements in the world. [Source: Encyclopedia of Global Religion; Jamaat-e-Islami]
broader: movements and organizations

movements and organizations
type: Concept
narrower: Jamaat-e-Islami

organizations
type: Collection
type: ConceptGroup
member: Jamaat-e-Islami