James Bryant Conant
type: Concept
definition: James Bryant Conant was a chemist, a university president, a government official, and an educational reformer. He was especially well known for his studies of high schools in the United States and for the processes used to prepare teachers for American classrooms. [Source: Encyclopedia of Educational Reform and Dissent; Conant, James Bryant (1893–1978)]
broader: key people in educational reform

key people in educational reform
type: Concept
narrower: James Bryant Conant

people
type: Collection
type: ConceptGroup
member: James Bryant Conant