James Cummins
type: Concept
definition: James Cummins is an internationally renowned researcher and advocate in the field of language minority education. His academic work has had a significant influence on the theoretical discourse of bilingual education and bilingual-ism. [Source: Encyclopedia of Bilingual Education; Cummins, James (1949-)]
broader: people and organizations

people and organizations
type: Concept
narrower: James Cummins

people
type: Collection
type: ConceptGroup
member: James Cummins