criminals
type: Concept
narrower: James Earl Ray

James Earl Ray
type: Concept
definition: James Earl Ray (March 10, 1928–April 23, 1998) was a career criminal convicted of the assassination of American civil rights leader Dr. Martin Luther King, Jr. [Source: The Social History of Crime and Punishment in America: An Encylopedia; Ray, James Earl]
broader: criminals

people
type: Collection
type: ConceptGroup
member: James Earl Ray