people associated with terrorism
type: Concept
narrower: James Ellison

James Ellison
type: Concept
definition: James Ellison was a preacher from Texas who in 1971 founded Zarephath-Horeb, a peaceful fundamentalist Christian group, in the Ozark Mountains of Arkansas. He eventually adopted Christian Identity, a race-based theology, and changed the name of his group to the Covenant, the Sword, and the Arm of the Lord (CSA). [Source: Encyclopedia of Terrorism; Ellison, James (?–)]
broader: people associated with terrorism

people
type: Collection
type: ConceptGroup
member: James Ellison