Japanese management
type: Concept
definition: Before Japan's miracle economic growth faltered in the early 1990s, Japanese management fascinated the West. During the 1970s and 1980s, Japan's manufacturing industries redefined global expectations about high-performance high-reliability products, notably in motor vehicles and consumer electronics. [Source: International Encyclopedia of Organization Studies; Japanese Management]
broader: international business

international business
type: Concept
narrower: Japanese management

concepts
type: Collection
type: ConceptGroup
member: Japanese management