theorists in sociology of education
type: Concept
narrower: Jay MacLeod

Jay MacLeod
type: Concept
definition: Jay MacLeod is best known for his book Ain't No Makin' It, in which he interviews and observes two groups of adolescent boys: the Hallway Hangers and the Brothers of Clarendon Heights. MacLeod not only provides readers with traditional ethnographic analysis, but he offers additional insight into the lives of these boys by conducting longitudinal assessments. [Source: Sociology of Education: An A-to-Z Guide; MacLeod, Jay]
broader: theorists in sociology of education

people
type: Collection
type: ConceptGroup
member: Jay MacLeod