Jean Gottmann
type: Concept
definition: Jean Gottmann was one of the premier urbanists of the 20th century. Born in the Ukraine, Gottmann was raised in France. [Source: Encyclopedia of Geography; Gottmann, Jean (1915–1994)]
broader: key people in geography

key people in geography
type: Concept
narrower: Jean Gottmann

people
type: Collection
type: ConceptGroup
member: Jean Gottmann