Journal of Curriculum Studies
type: Concept
definition: The Journal of Curriculum Studies (JCS) is an international, peer-reviewed journal with editorial offices in the United Kingdom, Canada, the United States, and Australia. JCS focuses on promoting a global examination of curriculum issues and an interdisciplinary understanding of curriculum practice that emphasizes a cross-cultural dialogue. [Source: Encyclopedia of Curriculum Studies; Journal of Curriculum Studies]
broader: publications

publications
type: Concept
narrower: Journal of Curriculum Studies

concepts
type: Collection
type: ConceptGroup
member: Journal of Curriculum Studies