Keith C. Monroe
type: Concept
definition: Keith C. Monroe (1929–1998) was a well-respected criminal defense attorney based in California who was best known for representing burglary suspect Ted Chimel before the U.S. Supreme Court in Chimel v. California (1969). He successfully argued for a suspect's right not to have his home searched without a warrant. [Source: Encyclopedia of the Fourth Amendment; Monroe, Keith C.]
broader: key people in the Fourth Amendment

key people in the Fourth Amendment
type: Concept
narrower: Keith C. Monroe

people
type: Collection
type: ConceptGroup
member: Keith C. Monroe