school types
type: Concept
narrower: Lancaster system

Lancaster system
type: Concept
definition: At the turn of the 19th century, the Industrial Revolution was well under way in America. Urban industrialization attracted millions of workers to the cities, bringing growing social concerns over poverty and crime. [Source: Encyclopedia of Educational Reform and Dissent; Lancaster System]
broader: school types

concepts
type: Collection
type: ConceptGroup
member: Lancaster system