Law Merchant
type: Concept
alternative label: lex mercatoria
definition: Lex mercatoria, or the “Law Merchant,” refers to the privately produced, privately adjudicated, and privately enforced body of customary law that governed virtually every aspect of commercial transactions by the end of the 11th century. Thus, the Law Merchant provides libertarians with an important example of effective law without coercive state authority.Rapid expansion in agricultural productivity during the 11th and 12th centuries meant that less labor was needed to produce sufficient food and clothing for Europe's population. [Source: The Encyclopedia of Libertarianism; Law Merchant]
broader: libertarianism

libertarianism
type: Concept
narrower: Law Merchant

concepts
type: Collection
type: ConceptGroup
member: Law Merchant