Fourth Amendment issues
type: Concept
narrower: Lone Wolf Amendment

concepts
type: Collection
type: ConceptGroup
member: Lone Wolf Amendment

Lone Wolf Amendment
type: Concept
definition: In December 2004, Congress passed the lone wolf amendment as part of the Intelligence Reform and Terrorism Prevention Act of 2004. The lone wolf provision amended the Foreign Intelligence Surveillance Act (FISA) to allow surveillance of non-U.S. persons engaging in “international terrorism or activities in preparation” where the individual lacks an explicit connection to a foreign power or international terrorist organization. [Source: Encyclopedia of the Fourth Amendment; Lone Wolf Amendment]
broader: Fourth Amendment issues