Madagascar
type: Concept
definition: Madagascar, formerly known as the Malagasy Republic, is the fourth largest island in the world. It was a French colony until it gained independence in 1960, and has remained desperately poor. [Source: Encyclopedia of Motherhood; Madagascar]
broader: Indian Ocean islands

Indian Ocean islands
type: Concept
narrower: Madagascar

concepts
type: Collection
type: ConceptGroup
member: Madagascar