international finance
type: Concept
narrower: Madrid General Index

Madrid General Index
type: Concept
definition: The Indice General de la Boisa de Madrid (IGBM), or Madrid General Index, represents the most relevant set of indices in Spain besides the IBEX 35. The Madrid General Index is comprised of a changing number of stocks (currently more than 100) that are traded in the Boisa de Madrid. [Source: Encyclopedia of Business in Today's World; Madrid General Index]
broader: international finance

concepts
type: Collection
type: ConceptGroup
member: Madrid General Index