Mariel Cubans
type: Concept
definition: Hispanics are the largest ethnic minority in the United States. Social scientists are finding that they have to broaden their scope of research to be inclusive of this demographic shift. [Source: Encyclopedia of Race and Crime; Mariel Cubans]
broader: specific populations

specific populations
type: Concept
narrower: Mariel Cubans

concepts
type: Collection
type: ConceptGroup
member: Mariel Cubans