institutions studying climate change
type: Concept
narrower: Massachusetts Institute of Technology

Massachusetts Institute of Technology
type: Concept
definition: THE MASSACHUSETTS INSTITUTE of Technology (MIT) is a private, coeducational research university located in Cambridge, Massachusetts. MIT has five schools and one college, containing 32 academic departments, with a strong emphasis on scientific and technological research. [Source: Encyclopedia of Global Warming and Climate Change; Massachusetts Institute of Technology]
broader: institutions studying climate change

organizations
type: Collection
type: ConceptGroup
member: Massachusetts Institute of Technology