Myanmar
type: Concept
definition: Myanmar, formerly Burma, is a poor Asian country dominated by Theraveda Buddhism but ruled by a military junta. Conflict and poverty characterize Myanmar's networks, traditional and online. [Source: Encyclopedia of Social Networks; Myanmar]
broader: Southeastern Asia

Southeastern Asia
type: Concept
narrower: Myanmar

concepts
type: Collection
type: ConceptGroup
member: Myanmar