African American activism
type: Concept
narrower: Nat Turner

Nat Turner
type: Concept
definition: Leader of one of the bloodiest slave revolts in American history, Nat Turner was born a slave on October 2, 1800, in Southampton County, Virginia. He grew up on the farm of Benjamin Turner, becoming the property of Turner's brother Samuel upon Benjamin's death in 1810. [Source: Encyclopedia of Activism and Social Justice; Turner, Nat (1800–1831)]
broader: African American activism

people
type: Collection
type: ConceptGroup
member: Nat Turner