Nathaniel Branden
type: Concept
definition: Nathaniel Branden (born Nathan Blumenthal) is known to many as “the father of the self-esteem movement.” Branden is the author of 20 books that explore the philosophical, psychological, and cultural foundations of individualism and the free society. Having developed a close personal relationship with novelist and philosopher Ayn Rand (whom he met as a college student in 1950), in 1958 Branden started Nathaniel Branden Lectures, in which he addressed and expanded on the psychological issues raised by Rand. [Source: The Encyclopedia of Libertarianism; Branden, Nathaniel (1930-)]
broader: key people in libertarianism

key people in libertarianism
type: Concept
narrower: Nathaniel Branden

people
type: Collection
type: ConceptGroup
member: Nathaniel Branden