Neolithic cultures
type: Concept
definition: The term Neolithic is frequently used to refer to that stage in humanity's history when people became sedentary and started farming. The Neolithic is normally conceptualized as a package that includes farming, sedentism, the making and use of stone tools, and crafts such as pottery and weaving. [Source: Encyclopedia of Anthropology; Neolithic Cultures]
broader: archaeology

archaeology
type: Concept
narrower: Neolithic cultures

concepts
type: Collection
type: ConceptGroup
member: Neolithic cultures