institutions studying climate change
type: Concept
narrower: Ohio State University

organizations
type: Collection
type: ConceptGroup
member: Ohio State University

Ohio State University
type: Concept
definition: Ohio State University (OSU) is a public land-grant research university founded in 1870. Located in Columbus, Ohio, OSU has been designated the flagship university in Ohio and operates branch campuses in Lima, Mansfield, Marion, Newark, and Wooster. [Source: Encyclopedia of Global Warming & Climate Change; Ohio State University]
broader: institutions studying climate change